Show Posts

This section allows you to view all posts made by this member. Note that you can only see posts made in areas you currently have access to.


Messages - shambhu66

Pages: [1]
1
General Chat / Re: Apertus Axiom Beta
« on: September 28, 2014, 05:12:13 PM »
I just donated EUR 15.00 and indicated in the comments that the money is to be used to help ML developers buy an Axiom Beta.

2
Compilation fails on OSX Maverick after Xcode was upgraded to version 5.1 on March 10, 2014.

[Edit:] I should have added that ML autoexec.bin and modules compile OK without any issue even after the Xcode upgrade.
compilation fails only for mlv_dump.


Code: [Select]
[ HOST_CC  ]   mlv_dump.host.o
clang: error: unknown argument: '-mno-ms-bitfields' [-Wunused-command-line-argument-hard-error-in-future]
clang: note: this will be a hard error (cannot be downgraded to a warning) in the future
make: *** [mlv_dump.host.o] Error 1

This did not help either:
export CFLAGS=-Qunused-arguments
export CPPFLAGS=-Qunused-arguments

Removed '-mno-ms-bitfields' from modules/mlv_rec/Makefile, but ld was not happy.

MLV_CFLAGS = -I$(SRC_DIR) -D MLV_USE_LZMA -m32 -Wpadded  -D _7ZIP_ST -D MLV2DNG

Code: [Select]
ld: warning: ld: warning: ignoring file ../../src/chdk-dng.host.o, file was built for i386 which is not the architecture being linked (x86_64): ../../src/chdk-dng.host.oignoring file mlv_dump.host.o, file was built for i386 which is not the architecture being linked (x86_64): mlv_dump.host.o

ld: warning: ignoring file ../lv_rec/raw2dng.host.o, file was built for i386 which is not the architecture being linked (x86_64): ../lv_rec/raw2dng.host.o
ld: warning: ignoring file lzma/lib7z.a, file was built for archive which is not the architecture being linked (x86_64): lzma/lib7z.a
Undefined symbols for architecture x86_64:
  "_main", referenced from:
     implicit entry/start for main executable
ld: symbol(s) not found for architecture x86_64
clang: error: linker command failed with exit code 1 (use -v to see invocation)
make: *** [mlv_dump] Error 1

Removed -m32 from modules/mlv_rec/Makefile, no luck either.

MLV_CFLAGS = -I$(SRC_DIR) -D MLV_USE_LZMA -Wpadded -D _7ZIP_ST -D MLV2DNG

Code: [Select]
Macintosh:mlv_rec okumar$ make clean && make mlv_dump
[ RM ]  mlv_rec.o mlv.o mlv_rec.mo mlv_rec.sym mlv_rec.dep module_strings.h *.o *.d *.dep *.sym hgstamp
[ RM ]  mlv_dump mlv_dump.exe lzma/7zAlloc.host.o lzma/7zBuf.host.o lzma/7zBuf2.host.o lzma/7zCrc.host.o lzma/7zCrcOpt.host.o lzma/7zDec.host.o lzma/7zFile.host.o lzma/7zIn.host.o lzma/7zStream.host.o lzma/Alloc.host.o lzma/Bcj2.host.o lzma/Bra.host.o lzma/Bra86.host.o lzma/BraIA64.host.o lzma/CpuArch.host.o lzma/Delta.host.o lzma/LzFind.host.o lzma/Lzma2Dec.host.o lzma/Lzma2Enc.host.o lzma/Lzma86Dec.host.o lzma/Lzma86Enc.host.o lzma/LzmaDec.host.o lzma/LzmaEnc.host.o lzma/LzmaLib.host.o lzma/Ppmd7.host.o lzma/Ppmd7Dec.host.o lzma/Ppmd7Enc.host.o lzma/Sha256.host.o lzma/Xz.host.o lzma/XzCrc64.host.o lzma/lib7z.a lzma/Threads.w32.o lzma/LzFindMt.w32.o lzma/MtCoder.w32.o lzma/7zAlloc.w32.o lzma/7zBuf.w32.o lzma/7zBuf2.w32.o lzma/7zCrc.w32.o lzma/7zCrcOpt.w32.o lzma/7zDec.w32.o lzma/7zFile.w32.o lzma/7zIn.w32.o lzma/7zStream.w32.o lzma/Alloc.w32.o lzma/Bcj2.w32.o lzma/Bra.w32.o lzma/Bra86.w32.o lzma/BraIA64.w32.o lzma/CpuArch.w32.o lzma/Delta.w32.o lzma/LzFind.w32.o lzma/Lzma2Dec.w32.o lzma/Lzma2Enc.w32.o lzma/Lzma86Dec.w32.o lzma/Lzma86Enc.w32.o lzma/LzmaDec.w32.o lzma/LzmaEnc.w32.o lzma/LzmaLib.w32.o lzma/Ppmd7.w32.o lzma/Ppmd7Dec.w32.o lzma/Ppmd7Enc.w32.o lzma/Sha256.w32.o lzma/Xz.w32.o lzma/XzCrc64.w32.o lzma/lib7z.w32.a
[ HOST_CC  ]   mlv_dump.host.o
mlv_dump.c:2034:38: error: no member named 'buffer' in 'struct raw_info'
                            raw_info.buffer = frame_buffer;
                            ~~~~~~~~ ^
1 error generated.
make: *** [mlv_dump.host.o] Error 1



Pages: [1]